LinuxSir.cn,穿越时空的Linuxsir!

 找回密码
 注册
搜索
热搜: shell linux mysql
楼主: zhllg

Gentoo-china-overlay

[复制链接]
发表于 2006-9-21 15:14:44 | 显示全部楼层
Post by debianl
我不知道这是不是subversion.eclass的问题,你可以删除掉/usr/portage/distfiles/svn-src/gaim再emerge就可以了

ft……结果是这个原因哦……我试试吧。谢谢哦
回复 支持 反对

使用道具 举报

发表于 2006-9-21 17:15:01 | 显示全部楼层

scim-bridge的ebuild有个小bug

没有更新gtk.immodules文件,在pkg_postinst()里面加上:

  

  1.     gtk-query-immodules-2.0 > ${ROOT}$(get_gtk_confdir)/gtk.immodules
  2.    
复制代码


卸载的时候:

  1. pkg_postrm() {

  2.    gtk-query-immodules-2.0 > ${ROOT}$(get_gtk_confdir)/gtk.immodules
  3. }
复制代码


另外默认USE没有打开agent,这样也没法用啊,还是打开的好。
回复 支持 反对

使用道具 举报

发表于 2006-9-25 13:10:58 | 显示全部楼层
部分包缺少amd64的keyword。
回复 支持 反对

使用道具 举报

发表于 2006-9-25 13:28:11 | 显示全部楼层
Post by 食古不化
部分包缺少amd64的keyword。


我提交的可能都缺少amd64的keyword,没办法测试,见谅!如果能够在amd64下正确地emerge烦请告之,修改好之后再提交上去。

另外portage里最近添加了gsopcast、eva,大家可以尝试尝试!gsopcast是一个基于p2p的网络电视前端,eva想必大家应该都知道了。
回复 支持 反对

使用道具 举报

发表于 2006-9-25 13:42:16 | 显示全部楼层
我不会测试,顶多看能否编译通过。
回复 支持 反对

使用道具 举报

 楼主| 发表于 2006-9-25 16:49:48 | 显示全部楼层
Post by 食古不化
我不会测试,顶多看能否编译通过。

足够了  !
回复 支持 反对

使用道具 举报

发表于 2006-9-25 20:09:27 | 显示全部楼层
我怎么今天安装gaim-svn,realplay,chmess全都失败啊,怎么回事?是我的系统有问题还是服务器的ebuild有问题?
回复 支持 反对

使用道具 举报

发表于 2006-9-25 20:11:22 | 显示全部楼层
/bin/sh ../../../libtool --silent --tag=CC --mode=link i686-pc-linux-gnu-gcc -I. -g -march=prescott -O2 -pipe   -o libgg.la -rpath /usr/lib/gaim -module -avoid-version -Wl,--export-dynamic -pthread -lgobject-2.0 -lgmodule-2.0 -ldl -lgthread-2.0 -lglib-2.0   gg-utils.lo confer.lo search.lo buddylist.lo gg.lo common.lo dcc.lo events.lo http.lo libgadu.lo obsolete.lo pubdir50.lo pubdir.lo -L. -lgadu -lnsl -lresolv
/usr/lib/gcc/i686-pc-linux-gnu/4.1.1/../../../../i686-pc-linux-gnu/bin/ld: cannot find -lgadu
collect2: ld returned 1 exit status
make[4]: *** [libgg.la] 错误 1
make[4]: Leaving directory `/var/tmp/portage/gaim-svn-2.0/work/gaim-svn-2.0/libgaim/protocols/gg'
make[3]: *** [all-recursive] 错误 1
make[3]: Leaving directory `/var/tmp/portage/gaim-svn-2.0/work/gaim-svn-2.0/libgaim/protocols'
make[2]: *** [all-recursive] 错误 1
make[2]: Leaving directory `/var/tmp/portage/gaim-svn-2.0/work/gaim-svn-2.0/libgaim'
make[1]: *** [all-recursive] 错误 1
make[1]: Leaving directory `/var/tmp/portage/gaim-svn-2.0/work/gaim-svn-2.0'
make: *** [all] 错误 2

!!! ERROR: net-im/gaim-svn-2.0 failed.
Call stack:
  ebuild.sh, line 1546:   Called dyn_compile
  ebuild.sh, line 937:   Called src_compile
  gaim-svn-2.0.ebuild, line 142:   Called die

!!! Make failed
!!! If you need support, post the topmost build error, and the call stack if relevant.

!!! This ebuild is from an overlay: '/usr/portage/local/layman/gentoo-china'
回复 支持 反对

使用道具 举报

发表于 2006-9-25 20:30:58 | 显示全部楼层
UNIXCompile(datatype/vorbis/renderer): generating makefiles
Warning: Missing BIF dep 'common_dbgtool' (module library ../../../common/dbgtool/rel/debuglib.a)
Warning: Missing BIF dep 'common_system' (module library ../../../common/system/rel/syslib.a)
Warning: Missing BIF dep 'common_container' (module library ../../../common/container/rel/contlib.a)
Warning: Missing BIF dep 'common_util' (module library ../../../common/util/rel/utillib.a)
Warning: Missing BIF dep 'common_runtime' (module library ../../../common/runtime/rel/runtlib.a)
UNIXCompile(datatype/vorbis/renderer): making depend
UNIXCompile(datatype/vorbis/renderer): making copy
ERROR: UNIXCompile(datatype/vorbis/renderer) ERROR: Make failed.
[#-00001510][2006-09-25 20:30:49][-1208125248][ERROR] : --- Build System Error ------------------------------------
You have found a Ribosome bug.
-----------------------------------------------------------
--- Python Traceback --------------------------------------
------------------------------------
Traceback (most recent call last):
  File "/home/build/src/build/bin/launcher.py", line 117, in __runTool
    tool.run()
  File "/var/tmp/portage/realplayer-10.0.8-r1/work/realplay-10.0.8/build/lib/build_exe.py", line 893, in run
    command_line_args()
  File "/var/tmp/portage/realplayer-10.0.8-r1/work/realplay-10.0.8/build/lib/build_exe.py", line 156, in command_line_args
    invoke_buildsystem(arg_list)
  File "/var/tmp/portage/realplayer-10.0.8-r1/work/realplay-10.0.8/build/lib/build_exe.py", line 111, in invoke_buildsystem
    app = buildapp.RunBuild(arg_list)
  File "/home/build/src/build/lib/buildapp.py", line 102, in RunBuild
    app.main()
  File "/home/build/src/build/lib/buildapp.py", line 196, in main
    self.run()
  File "/home/build/src/build/lib/buildapp.py", line 395, in run
    self.collate_modules()
  File "/home/build/src/build/lib/buildapp.py", line 1271, in collate_modules
    chaingang.ChainGang( todo, make_jobs ).run()
  File "/home/build/src/build/lib/chaingang.py", line 242, in run
    self.worker()
  File "/home/build/src/build/lib/chaingang.py", line 263, in worker
    self.doit(todo)
  File "/home/build/src/build/lib/chaingang.py", line 254, in doit
    todo.run(self)
  File "/home/build/src/build/lib/chaingang.py", line 169, in run
    apply(self.fun, self.args)
  File "/home/build/src/build/lib/buildapp.py", line 1101, in collate_module
    self.collate_halt_or_print_error(module, e)
  File "/home/build/src/build/lib/buildapp.py", line 1032, in collate_halt_or_print_error
    raise err.error, e
Build System Error: Make failed.
-----------------------------------------------------------

Traceback (most recent call last):
  File "/var/tmp/portage/realplayer-10.0.8-r1/work/realplay-10.0.8/build/bin/build.py", line 67, in ?
    tool.run()
  File "/var/tmp/portage/realplayer-10.0.8-r1/work/realplay-10.0.8/build/bin/launcher.py", line 97, in run
    self.__runTool()               
  File "/var/tmp/portage/realplayer-10.0.8-r1/work/realplay-10.0.8/build/bin/launcher.py", line 117, in __runTool
    tool.run()
  File "/var/tmp/portage/realplayer-10.0.8-r1/work/realplay-10.0.8/build/lib/build_exe.py", line 893, in run
    command_line_args()
  File "/var/tmp/portage/realplayer-10.0.8-r1/work/realplay-10.0.8/build/lib/build_exe.py", line 156, in command_line_args
    invoke_buildsystem(arg_list)
  File "/var/tmp/portage/realplayer-10.0.8-r1/work/realplay-10.0.8/build/lib/build_exe.py", line 111, in invoke_buildsystem
    app = buildapp.RunBuild(arg_list)
  File "/var/tmp/portage/realplayer-10.0.8-r1/work/realplay-10.0.8/build/lib/buildapp.py", line 102, in RunBuild
    app.main()
  File "/var/tmp/portage/realplayer-10.0.8-r1/work/realplay-10.0.8/build/lib/buildapp.py", line 196, in main
    self.run()
  File "/var/tmp/portage/realplayer-10.0.8-r1/work/realplay-10.0.8/build/lib/buildapp.py", line 395, in run
    self.collate_modules()
  File "/var/tmp/portage/realplayer-10.0.8-r1/work/realplay-10.0.8/build/lib/buildapp.py", line 1271, in collate_modules
    chaingang.ChainGang( todo, make_jobs ).run()
  File "/var/tmp/portage/realplayer-10.0.8-r1/work/realplay-10.0.8/build/lib/chaingang.py", line 242, in run
    self.worker()
  File "/var/tmp/portage/realplayer-10.0.8-r1/work/realplay-10.0.8/build/lib/chaingang.py", line 263, in worker
    self.doit(todo)
  File "/var/tmp/portage/realplayer-10.0.8-r1/work/realplay-10.0.8/build/lib/chaingang.py", line 254, in doit
    todo.run(self)
  File "/var/tmp/portage/realplayer-10.0.8-r1/work/realplay-10.0.8/build/lib/chaingang.py", line 169, in run
    apply(self.fun, self.args)
  File "/var/tmp/portage/realplayer-10.0.8-r1/work/realplay-10.0.8/build/lib/buildapp.py", line 1101, in collate_module
    self.collate_halt_or_print_error(module, e)
  File "/var/tmp/portage/realplayer-10.0.8-r1/work/realplay-10.0.8/build/lib/buildapp.py", line 1032, in collate_halt_or_print_error
    raise err.error, e
Build System Error: Make failed.

!!! ERROR: media-video/realplayer-10.0.8-r1 failed.
Call stack:
  ebuild.sh, line 1546:   Called dyn_compile
  ebuild.sh, line 937:   Called src_compile
  realplayer-10.0.8-r1.ebuild, line 87:   Called die

!!! (no error message)
!!! If you need support, post the topmost build error, and the call stack if relevant.

!!! This ebuild is from an overlay: '/usr/portage/local/layman/gentoo-china'
回复 支持 反对

使用道具 举报

 楼主| 发表于 2006-9-25 20:46:07 | 显示全部楼层
请看第一贴,了解如何报告bug
回复 支持 反对

使用道具 举报

您需要登录后才可以回帖 登录 | 注册

本版积分规则

快速回复 返回顶部 返回列表